{"text_format":"1","workbook":"xlsx","n_sheets":11,"sheets":["Instructions","Security - Emergency Managment","Security Force","Entry Control","Fencing and Gates","Parking and Barriers","Building Envelope","CCV - VSS","Summary","Action Items","Glossary"],"not_rendered":{"charts":1,"images":55,"macros":1,"external_links":0,"defined_names":19,"comments":0,"pivot_tables":0},"unopened":[],"bounds":{"document_bytes":16777216,"sheet_cells":100000,"rows_first":2000,"rows_last":500,"rows_between":2000,"halvings":0,"cell_chars":16384,"cell_head_chars":4096},"cells_cut":0,"cells_raw":0,"read":"whole","date_system":"1900"}

{"sheet":"Instructions","index":0,"n_rows":11,"n_cols":2,"rows_kept":11,"cut":false,"hidden":false,"merged":[]}
[]
[]
[]
[]
[]
[null,"This U.S. Department of Homeland Security (DHS) survey is intended to help K-12 school "]
{"$rows_left_out":6}
{"sheet":"Security - Emergency Managment","index":1,"n_rows":61,"n_cols":9,"rows_kept":61,"cut":false,"hidden":false,"merged":[]}
["Security management refers to the people, plans, and procedures that a K-12 school has in place to deal with security issues, including but not limited to active-shooter issues. Factors that contribute to the effectiveness of security and emergency management efforts at schools include the designation of a security manager; existence of security and emergency operations plans; commitment to training and exercises on these plans; procedures for handling suspicious objects; and engaging in preparedness and security working groups with external partners. Schools may use different names for a security plan or incorporate elements of a security plan into broader emergency operations plans, which outline the school’s approach to operations before, during, and after an emergency. Understanding which activities occur at an individual school level and which activities occur at the school district level are important considerations for K-12 school personnel to factor into their security and emergency management practices."]
["Question","Very Low","Low","Medium","High","Very High","Options for Consideration","Sec./Em. Management Score"]
["1. Does the school have a security manager or security department?","Neither the school nor the district has a security manager or department.","The school district has a security manager who also performs other functions in addition to security management.","The school district has a security manager who has no other additional duties.","The school district has a security management department. Multiple employees are dedicated to security management at the district level, but no one within the department is assigned to manage security specifically at the school in question.","The school has a dedicated security manager or security department."]
["Select Option:",null,null,null,null,null,null,null,0]
["Background:"]
["Reference:"]
{"$rows_left_out":56}
{"sheet":"Security Force","index":2,"n_rows":63,"n_cols":9,"rows_kept":63,"cut":false,"hidden":false,"merged":[]}
["A security force is a group of school employees or contractors whose sole responsibilities are to provide security at a school. A security force does not include general school personnel who are trained in security awareness (i.e., observe and report) in addition to their regular duties. Security forces at schools may include school resource officers (SROs), who are sworn law enforcement officers responsible for safety and crime prevention in schools. A local police department, sheriff's agency, or school system typically employs SROs who work closely with school administrators in an effort to create a safer environment. The responsibilities of SROs are similar to regular police officers in that they have the ability to make arrests, respond to calls for service, and document incidents that occur within their jurisdiction. Some schools may have a dedicated SRO who is assigned full-time to an individual school. Other schools may have SROs who balance responsibilities at multiple schools within a district. Other models may involve full- or part-time private security personnel serving in security force roles, or school officials serving in multiple roles that include but are not limited to security. In this section, a school is considered to have security force only if it has people whose sole responsibilities are to provide security. "]
["Question","Very Low","Low","Medium","High","Very High","Options for Consideration","Security Force Score"]
["1. Does the school have a security force? ","The school does not have a security force. ","The school does not have a defined security force, but faculty or staff may have an additional duty related to security.","A security force exists within the district but is assigned additional duties. The security force may be a contracted guard, law enforcement, or an employee hired for the purpose of security. This force may occasionally visit the school.","A security force is employed or contracted for the specific purpose of school security. May visit the school routinely or during events or investigations. This may include an SRO (law enforcement) who has other assigned duties or is responsible for multiple locations.","The school has an onsite security force (at school) at all times. The security force is employed or contracted for the specific purpose of school security. This may include an SRO (law enforcement) who is responsible for the single location and is assigned full-time."]
["Select Option:",null,null,null,null,null,null,null,0]
["Background:"]
["Reference:"]
{"$rows_left_out":58}
{"sheet":"Entry Control","index":3,"n_rows":466,"n_cols":9,"rows_kept":466,"cut":false,"hidden":false,"merged":[]}
["Controlling how and when faculty, staff, students, and visitors can access school buildings and grounds is considered an effective mechanism for protecting against different threats, including active shooters. These controls can include minimizing the number of points of entry, requiring identification, or conducting searches. However, these entry controls may sometimes run counter to the overarching objective of creating an open learning environment at K-12 schools. Entry controls are part of the broader layers of defense that schools have in place to enhance security. These layers of protective measures are deployed in concentric circles around a school, starting at the outer perimeter and moving inward to areas with the greatest need for protection. Entry controls can help deter individuals from initiating violent attacks, detect attacks earlier at a safe distance, and delay attackers from reaching vulnerable and/or highly populated locations. "]
["Question","Very Low","Low","Medium","High","Very High","Options for Consideration","Entry Control Score"]
["1. Are exterior doors locked during regular school hours?","The school does not typically secure doors throughout the school day.","The school locks most exterior doors other than at beginning and ending of the class day. Often an exterior door other than the main doors is opened to allow access to an outdoor event. The doorway is typically not secured or is propped open while the event is occurring. Loading docks are typically left unsecured during school hours.","The school locks all exterior doors other than at beginning and ending of the class day. Exterior doors are not alarmed. Occasionally an exterior door other than the main doors is opened to allow access to an outdoor event. The doorway is typically not secured or is propped open while the event is occurring.","The school locks all exterior doors other than at beginning and ending of the class day. Some exterior doors are equipped with alarms. Occasionally an exterior door other than the main doors is opened to allow access to an outdoor event. The opened doorway is monitored by faculty/staff or security, or is secured while the event is occurring.","The school locks all exterior doors other than at beginning and ending of the class day. All exterior doors are equipped with alarms. Any exit to outdoor events during the school day not using the main entrances requires security to open and secure the door. "]
["Select Option:",null,null,null,null,null,null,null,0]
["Background:"]
["Reference:"]
{"$rows_left_out":461}
{"sheet":"Fencing and Gates","index":4,"n_rows":37,"n_cols":9,"rows_kept":37,"cut":false,"hidden":false,"merged":[]}
["Fences are barriers enclosing or bordering a school that are used to prevent entrance, contain people to particular areas, or mark a boundary. Gates are openings in that perimeter that allow people or vehicles to pass through at controlled points of entry. Together, fences and gates are part of the broader layers of defense that schools have in place to protect against a spectrum of security issues, including but not limited to active shooters. These layers of protective measures are deployed in concentric circles around a school, starting at the outer perimeter and moving inward to areas with the greatest need for protection. Often fences are installed at a school for the purpose of protecting people and property from harm or damage from playground or sports items. These sections of fence may serve dual purposes of security and protection. However, when looking at fence lines, school officials should consider all sections of the fence, not just the tallest, newest, or what appears to be most secure. Areas where a person could easily penetrate the fence line and access the property are also important to evaluate. Fences and gates may deter or delay active-shooter intrusion. Fence construction may include different materials (e.g., chain link, wood, wrought iron, plastic), heights, anchoring, and other features (e.g., barbed wire along the top, privacy screening, outriggers). Similarly, gates can apply to vehicles and pedestrians and may include moveable bollards, roller or slide gates, swing gates, or turnstiles, among other construction options. It is understood that use of fences or gates is simply not practical in many locations. In that case, the building envelope, in particular windows and doors and the entry control process are the primary elements to deter or delay."]
["Question","Very Low","Low","Medium","High","Very High","Options for Consideration","Fencing and Gates Score"]
["1. Does the school have fencing?","The school is an open campus without fencing, or the school has fencing, but the fence is weak, old, or in disrepair. There may be holes in the fencing material, weak areas, or gaps between the fencing. The fence does not clearly define the school’s perimeter.",null,"The school has a fence, but it does not enclose the school. It may enclose a playground, part of the school grounds, or a stadium or athletic field. ",null,"Fencing completely encloses the school. No persons can enter any part of the school property without going through a gate in the fence or through the main entrance doors. "]
["Select Option:",null,null,null,null,null,null,null,0]
["Background:"]
["Reference:"]
{"$rows_left_out":32}
{"sheet":"Parking and Barriers","index":5,"n_rows":26,"n_cols":9,"rows_kept":26,"cut":false,"hidden":false,"merged":[]}
["Parking and barriers are part of the broader layers of defense that schools have in place to enhance security. These security measures may be considered more relevant to explosive threats (i.e., where standoff distance is important) or vehicle ramming threats (i.e., where high-speed avenues of approach are a concern). However, parking controls and barriers can also help deter individuals from initiating armed attacks; detect these attacks earlier at a safe distance; and delay attackers from reaching vulnerable and/or highly populated locations on school grounds. Monitoring parking areas for suspicious or illegal vehicle placement can include viewing the parking area via security cameras, requiring onsite security personnel to conduct patrols, or maintaining incidental visual contact through windows. Vehicle screening processes may also uncover weapons that individuals plan to use in active-shooter attacks."]
["Question","Very Low","Low","Medium","High","Very High","Options for Consideration","Parking and Barriers Score"]
["1. Are vehicles parked at the school screened, monitored, and/or inspected?","The school does not screen, monitor, or inspect any vehicles driven onsite. ","The school has written policies and procedures for vehicle searches. Signage warns that any vehicle parked on school property is subject to search. The school has no way to identify vehicles parked onsite. ","The school has comprehensive vehicle search policies and procedures. Any vehicle parked on campus is subject to search. Drivers are required to display their parking permits or their vehicles will be towed. School personnel do not patrol parking lots. ","Personnel conduct vehicle searches randomly and when suspicious activity is reported. Parking permits are required except in the designated visitor parking area(s). School personnel patrol parking lots, but the school has no camera coverage. ","The security force conducts vehicle searches randomly and when suspicious activity is reported. Parking permits are required. Security patrols the parking lot(s), and the school has camera coverage for all parking areas. "]
["Select Option:",null,null,null,null,null,null,null,0]
["Background:"]
["Reference:"]
{"$rows_left_out":21}
{"sheet":"Building Envelope","index":6,"n_rows":61,"n_cols":9,"rows_kept":61,"cut":false,"hidden":false,"merged":[]}
["Building envelope is the exterior face of a school building, including walls, roof, windows, and doors. The building envelope provides a significant layer of defense but also includes notable vulnerabilities (i.e., doors, windows) that are important to consider for physical security. Construction materials for doors and windows in particular influence the effectiveness of these features in deterring, delaying, or denying active-shooter attacks. For doors, options include metal- or wood-framed glass; solid- or hollow-core wood; fire-rated steel or aluminum; hollow steel; metal clad; or blast-resistant. Windows may include tempered glass; wire-reinforced glass; laminated glass; bullet-proof glass; and blast-resistant safety films. Access to utilities and fire alarms are important physical security considerations in active-shooter situations because attackers can coopt these features to create diversions or complicate response efforts. Portable buildings that are used for classrooms often add unique challenges. Portable buildings or temporary structures used for classrooms often do not have the same construction features as the primary building. Thus, windows and doors will not have the same level of security. Often the portable buildings are located in unsecured areas that provide easy access to an attacker. If a school has portable buildings and eliminating their use is not practical, additional security measures are often necessary, including increased monitoring, assigned security personnel, retrofitting doors and locks, or ballistic protection on the windows. Securing these school building features as part of steady-state efforts may deter attackers from attempting to exploit them. "]
["Question","Very Low","Low","Medium","High","Very High","Options for Consideration","Building Envelope Score"]
["1. Does the construction of exterior doors deter or delay an attack?","The school’s main doors are tempered glass with a metal frame. At least half the door is glass. Other doors may or may not have glass, and other exterior doors may be hollow steel. ",null,"The school’s main doors are steel, but nearly half the door is tempered or reinforced glass. Other exterior doors may be hollow steel with or without windows. ",null,"The school’s main doors are double-wall steel with at most a small skylight of reinforced glass. Breaking the glass will not easily allow access to a door latch. Other exterior doors are similar and do not have windows. "]
["Select Option:",null,null,null,null,null,null,null,0]
["Background:"]
["Reference:"]
{"$rows_left_out":56}
{"sheet":"CCV - VSS","index":7,"n_rows":37,"n_cols":9,"rows_kept":37,"cut":false,"hidden":false,"merged":[]}
["CCV and video surveillance systems (VSS) are electronic systems of cameras, control equipment, recorders, and related apparatus used for surveillance or alarm assessment. These systems can help deter individuals from initiating armed attacks and detect these attacks earlier at a safe distance. CCV/VSS technology options include a range of technologies (i.e., digital or analog, fiber or wireless transmission) and features (i.e., color or black-and-white video, adjustable side-to-side or up-and-down movement of cameras, wide-angle or zoom views). They also can include software that helps identify anomalies and ultimately the ability of users to identify suspicious behaviors. Schools may have dedicated security staff who monitor these systems in real time, or they may only view recorded information in response to specific incidents or inquiries. Following an incident, CCV/VSS data can provide valuable forensic information that first responders can use in response efforts and follow-on investigations. Surveillance cameras can be used to monitor common areas that are not within the normal view of teachers, administrators, or security personnel. Video surveillance can also streamline access control procedures, allowing administrative or security personnel to monitor and control locked entrances remotely when used with intercoms and remote control door locks, if practical."]
["Question","Very Low","Low","Medium","High","Very High","Options for Consideration","CCV/VSS Score"]
["1. Does the school have a camera system?","The school has no camera system in place.","The school has cameras, but coverage of sensitive areas is minimal.","Cameras are in place and effective in most areas. Some entrances and sensitive areas may lack coverage. ","Cameras cover most areas of the school, including entrances and sensitive areas. ","Camera coverage is complete and covers all areas of the school, including entrances and sensitive areas. "]
["Select Option:",null,null,null,null,null,null,null,0]
["Background:"]
["Reference:"]
{"$rows_left_out":32}
{"sheet":"Summary","index":8,"n_rows":96,"n_cols":11,"rows_kept":96,"cut":false,"hidden":false,"merged":[]}
[]
[]
[null,null,null,null,null,null,null,null,null,"CCV/VSS",{"$f":"(SUM('CCV - VSS'!H3,'CCV - VSS'!H8,'CCV - VSS'!H13,'CCV - VSS'!H18,'CCV - VSS'!H23)*100/25)","v":0}]
[null,null,null,null,null,null,null,null,null,"Building Envelope",{"$f":"(SUM('Building Envelope'!H3,'Building Envelope'!H8,'Building Envelope'!H13,'Building Envelope'!H17,'Building Envelope'!H22,'Building Envelope'!H27,'Building Envelope'!H31,'Building Envelope'!H35)*100/40)","v":0}]
[null,null,null,null,null,null,null,null,null,"Parking and Barriers",{"$f":"(SUM('Parking and Barriers'!H3,'Parking and Barriers'!H8,'Parking and Barriers'!H12,'Parking and Barriers'!H16,'Parking and Barriers'!H21)*100/25)","v":0}]
[null,null,null,null,null,null,null,null,null,"Fencing and Gates",{"$f":"(SUM('Fencing and Gates'!H3,'Fencing and Gates'!H8,'Fencing and Gates'!H13,'Fencing and Gates'!H18,'Fencing and Gates'!H23)*100/25)","v":0}]
{"$rows_left_out":91}
{"sheet":"Action Items","index":9,"n_rows":55,"n_cols":5,"rows_kept":55,"cut":false,"hidden":false,"merged":[]}
["Priority","Category","Option(s) for Consideration","Assigned to","Status"]
[null,"Security/Emergency Management",{"$f":"IF('Security - Emergency Managment'!G3<>\"\",'Security - Emergency Managment'!G3,\"\")","v":""}]
[null,"Security/Emergency Management",{"$f":"IF('Security - Emergency Managment'!G8<>\"\",'Security - Emergency Managment'!G8,\"\")","v":""}]
[null,"Security/Emergency Management",{"$f":"IF('Security - Emergency Managment'!G13<>\"\",'Security - Emergency Managment'!G13,\"\")","v":""}]
[null,"Security/Emergency Management",{"$f":"IF('Security - Emergency Managment'!G18<>\"\",'Security - Emergency Managment'!G18,\"\")","v":""}]
[null,"Security/Emergency Management",{"$f":"IF('Security - Emergency Managment'!G23<>\"\",'Security - Emergency Managment'!G23,\"\")","v":""}]
{"$rows_left_out":50}
{"sheet":"Glossary","index":10,"n_rows":37,"n_cols":2,"rows_kept":37,"cut":false,"hidden":false,"merged":[]}
["Glossary"]
["Term","Definition"]
["Active Monitoring","Active monitoring activity includes observing interactions, watching for suspicious or unusual activity, and providing an alert presence that may provide for early observation of a possible attack or may deter an attack entirely. "]
["Building Envelope","Building envelope is the exterior face of a school building, including walls, roof, windows, and doors. These elements may provide a significant layer of defense but may also include notable vulnerabilities that are important to consider for physical security."]
["Camera System Survey","A camera system survey is conducted to determine if the design and use of the surveillance system is appropriate given the school’s security needs, the intended purpose of the system, and for the given circumstances."]
["Closed-circuit Video (CCV) / Video Surveillance Systems (VSS)","CCV and VSS are electronic systems of cameras, control equipment, recorders, and related apparatus used for surveillance or alarm assessment. They include a range of technologies (i.e., digital or analog, fiber or wireless transmission) and features (i.e., color or black-and-white video, adjustable side-to-side or up-and-down movement of cameras, wide-angle or zoom views). They also can include software that helps identify anomalies and ultimately the ability of users to identify suspicious behaviors."]
{"$rows_left_out":31}